Reaction Details
TargetBeta-1 adrenergic receptor
LigandBDBM50348427
Substrate/Competitorn/a
Meas. Tech.ChEMBL_755354 (CHEMBL1804510)
Ki 116700±n/a nM
Citation Jozwiak, KWoo, AYTanga, MJToll, LJimenez, LKozocas, JAPlazinska, AXiao, RPWainer, IW Comparative molecular field analysis of fenoterol derivatives: A platform towards highly selective and effective beta(2)-adrenergic receptor agonists. Bioorg Med Chem18:728-36 (2010) 
 
Beta-1 adrenergic receptor
Name:Beta-1 adrenergic receptor
Type:Protein
Mol. Mass.:50486.84
Organism:Rattus norvegicus (Rat)
Description:P18090
Residue:466
BDBM50348427
NameBDBM50348427
Synonyms:CHEMBL1800960 | US9492405, 49
TypeSmall organic molecule
Emp. Form.C18H23NO4
Mol. Mass.317.3795
SMILESCC[C@@H](Cc1ccc(O)cc1)NC[C@H](O)c1cc(O)cc(O)c1