Reaction Details
TargetNeuropeptide S receptor
LigandBDBM50348615
Substrate/Competitorn/a
Meas. Tech.ChEMBL_755375 (CHEMBL1804531)
IC50 46±n/a nM
Citation Trotter, BWNanda, KKManley, PJUebele, VNCondra, CLGotter, ALMenzel, KHenault, MStocco, RRenger, JJHartman, GDBilodeau, MT Tricyclic imidazole antagonists of the Neuropeptide S Receptor. Bioorg Med Chem Lett20:4704-8 (2010) 
 
Neuropeptide S receptor
Name:Neuropeptide S receptor
Type:PROTEIN
Mol. Mass.:42692.30
Organism:Homo sapiens (Human)
Description:ChEMBL_1276607
Residue:371
BDBM50348615
NameBDBM50348615
Synonyms:CHEMBL1801359
TypeSmall organic molecule
Emp. Form.C23H23ClN2O2
Mol. Mass.394.894
SMILESCOc1cccc2-c3nccn3C(CC3CCOCC3)(c12)c1ccc(Cl)cc1