Reaction Details
TargetChymase
LigandBDBM50349172
Substrate/Competitorn/a
Meas. Tech.ChEMBL_759674 (CHEMBL1811418)
IC50 25±n/a nM
Citation Lo, HYNemoto, PAKim, JMHao, MHQian, KCFarrow, NAAlbaugh, DRFowler, DMSchneiderman, RDMichael August, EMartin, LHill-Drzewi, MPullen, SSTakahashi, HDe Lombaert, S Benzimidazolone as potent chymase inhibitor: modulation of reactive metabolite formation in the hydrophobic (P1) region. Bioorg Med Chem Lett21:4533-9 (2011) 
 
Chymase
Name:Chymase
Type:Enzyme
Mol. Mass.:27340.12
Organism:Homo sapiens (Human)
Description:n/a
Residue:247
BDBM50349172
NameBDBM50349172
Synonyms:CHEMBL1807640
TypeSmall organic molecule
Emp. Form.C22H22ClN3O3
Mol. Mass.411.881
SMILESCc1c(C)c2cc(Cl)cc(Cn3c4ccccc4n(CCC(O)=O)c3=O)c2n1C