Reaction Details
TargetCathepsin G
LigandBDBM50349179
Substrate/Competitorn/a
Meas. Tech.ChEMBL_759675 (CHEMBL1811508)
IC50>10±n/a nM
Citation Lo, HYNemoto, PAKim, JMHao, MHQian, KCFarrow, NAAlbaugh, DRFowler, DMSchneiderman, RDMichael August, EMartin, LHill-Drzewi, MPullen, SSTakahashi, HDe Lombaert, S Benzimidazolone as potent chymase inhibitor: modulation of reactive metabolite formation in the hydrophobic (P1) region. Bioorg Med Chem Lett21:4533-9 (2011) 
 
Cathepsin G
Name:Cathepsin G
Type:PROTEIN
Mol. Mass.:28860.08
Organism:Homo sapiens (Human)
Description:ChEMBL_1469016
Residue:255
BDBM50349179
NameBDBM50349179
Synonyms:CHEMBL1807537
TypeSmall organic molecule
Emp. Form.C21H21N3O3
Mol. Mass.363.4097
SMILESCc1cc2cccc(Cn3c4ccccc4n(CCC(O)=O)c3=O)c2n1C