Reaction Details
TargetChymase
LigandBDBM50349188
Substrate/Competitorn/a
Meas. Tech.ChEMBL_759674 (CHEMBL1811418)
IC50>10000±n/a nM
Citation Lo, HYNemoto, PAKim, JMHao, MHQian, KCFarrow, NAAlbaugh, DRFowler, DMSchneiderman, RDMichael August, EMartin, LHill-Drzewi, MPullen, SSTakahashi, HDe Lombaert, S Benzimidazolone as potent chymase inhibitor: modulation of reactive metabolite formation in the hydrophobic (P1) region. Bioorg Med Chem Lett21:4533-9 (2011) 
 
Chymase
Name:Chymase
Type:Enzyme
Mol. Mass.:27340.12
Organism:Homo sapiens (Human)
Description:n/a
Residue:247
BDBM50349188
NameBDBM50349188
Synonyms:CHEMBL1807532
TypeSmall organic molecule
Emp. Form.C19H18N4O3
Mol. Mass.350.3712
SMILESCc1cccc2ncc(Cn3c4ccccc4n(CCC(O)=O)c3=O)n12