Reaction Details
TargetCathepsin G
LigandBDBM50349172
Substrate/Competitorn/a
Meas. Tech.ChEMBL_759675 (CHEMBL1811508)
IC50 22±n/a nM
Citation Lo, HYNemoto, PAKim, JMHao, MHQian, KCFarrow, NAAlbaugh, DRFowler, DMSchneiderman, RDMichael August, EMartin, LHill-Drzewi, MPullen, SSTakahashi, HDe Lombaert, S Benzimidazolone as potent chymase inhibitor: modulation of reactive metabolite formation in the hydrophobic (P1) region. Bioorg Med Chem Lett21:4533-9 (2011) 
 
Cathepsin G
Name:Cathepsin G
Type:PROTEIN
Mol. Mass.:28860.08
Organism:Homo sapiens (Human)
Description:ChEMBL_1469016
Residue:255
BDBM50349172
NameBDBM50349172
Synonyms:CHEMBL1807640
TypeSmall organic molecule
Emp. Form.C22H22ClN3O3
Mol. Mass.411.881
SMILESCc1c(C)c2cc(Cl)cc(Cn3c4ccccc4n(CCC(O)=O)c3=O)c2n1C