Reaction Details
TargetTranscription factor Jun
LigandBDBM50349194
Substrate/Competitorn/a
Meas. Tech.ChEMBL_759677 (CHEMBL1811510)
EC50 130±n/a nM
Citation Diyabalanage, TRatnayake, RWilson, JAHenrich, CJBeutler, JAColburn, NHMcMahon, JBGustafson, KR Nothospondin, a new AP-1 inhibitory quassinoid from the Cameroonian plant Nothospondias staudtii. Bioorg Med Chem Lett21:4397-9 (2011) 
 
Transcription factor Jun
Name:Transcription factor Jun
Type:n/a
Mol. Mass.:35683.24
Organism:Homo sapiens (Human)
Description:P05412
Residue:331
BDBM50349194
NameBDBM50349194
Synonyms:GLAUCARUBINONE | NSC-14975
TypeSmall organic molecule
Emp. Form.C25H34O10
Mol. Mass.494.5315
SMILESCC[C@](C)(O)C(=O)O[C@@H]1[C@H]2[C@@H](C)[C@@H](O)[C@]3(O)OC[C@@]22[C@H]3[C@]3(C)[C@@H](C[C@H]2OC1=O)C(C)CC(=O)C3=O