Reaction Details
TargetTransmembrane protease serine 11D
LigandBDBM50349349
Substrate/Competitorn/a
Meas. Tech.ChEMBL_760105 (CHEMBL1810428)
Ki 34±n/a nM
Citation Sielaff, FBöttcher-Friebertshäuser, EMeyer, DSaupe, SMVolk, IMGarten, WSteinmetzer, T Development of substrate analogue inhibitors for the human airway trypsin-like protease HAT. Bioorg Med Chem Lett21:4860-4 (2011) 
 
Transmembrane protease serine 11D
Name:Transmembrane protease serine 11D
Type:PROTEIN
Mol. Mass.:46272.53
Organism:Homo sapiens (Human)
Description:ChEMBL_840134
Residue:418
BDBM50349349
NameBDBM50349349
Synonyms:CHEMBL1809255
TypeSmall organic molecule
Emp. Form.C34H46N8O5S
Mol. Mass.678.845
SMILES[#7]\[#6](-[#7])=[#7]\[#6]-[#6]-[#6]-[#6@@H](-[#7]S(=O)(=O)[#6]-c1ccccc1)-[#6](=O)-[#6@H](-[#6]-[#6]-[#6]-[#6]-[#7]-[#6](=O)-[#8]-[#6]-c1ccccc1)-[#7]-[#6]-c1ccc(cc1)-[#6](-[#7])=[#7]