Reaction Details
TargetProthrombin
LigandBDBM50349336
Substrate/Competitorn/a
Meas. Tech.ChEMBL_760106 (CHEMBL1810429)
Ki 13.5±n/a nM
Citation Sielaff, FBöttcher-Friebertshäuser, EMeyer, DSaupe, SMVolk, IMGarten, WSteinmetzer, T Development of substrate analogue inhibitors for the human airway trypsin-like protease HAT. Bioorg Med Chem Lett21:4860-4 (2011) 
 
Prothrombin
Name:Prothrombin
Type:Protein
Mol. Mass.:70029.57
Organism:Homo sapiens (Human)
Description:P00734
Residue:622
BDBM50349336
NameBDBM50349336
Synonyms:CHEMBL1809241
TypeSmall organic molecule
Emp. Form.C29H39N7O5S
Mol. Mass.597.729
SMILESNC(=N)c1ccc(CNC(=O)[C@@H]2CCCN2C(=O)[C@@H](CCC(=O)N2CCNCC2)NS(=O)(=O)Cc2ccccc2)cc1