Reaction Details
TargetProthrombin
LigandBDBM50349348
Substrate/Competitorn/a
Meas. Tech.ChEMBL_760106 (CHEMBL1810429)
Ki 74±n/a nM
Citation Sielaff, FBöttcher-Friebertshäuser, EMeyer, DSaupe, SMVolk, IMGarten, WSteinmetzer, T Development of substrate analogue inhibitors for the human airway trypsin-like protease HAT. Bioorg Med Chem Lett21:4860-4 (2011) 
 
Prothrombin
Name:Prothrombin
Type:Protein
Mol. Mass.:70029.57
Organism:Homo sapiens (Human)
Description:P00734
Residue:622
BDBM50349348
NameBDBM50349348
Synonyms:CHEMBL1809254
TypeSmall organic molecule
Emp. Form.C23H33N7O3S
Mol. Mass.487.618
SMILES[#6]-[#6@H](-[#7]-[#6]-c1ccc(cc1)-[#6](-[#7])=[#7])-[#6](=O)-[#6@@H](-[#6]-[#6]-[#6]\[#7]=[#6](\[#7])-[#7])-[#7]S(=O)(=O)[#6]-c1ccccc1