Reaction Details
TargetCoagulation factor X
LigandBDBM50349350
Substrate/Competitorn/a
Meas. Tech.ChEMBL_760107 (CHEMBL1810430)
Ki 14.5±n/a nM
Citation Sielaff, FBöttcher-Friebertshäuser, EMeyer, DSaupe, SMVolk, IMGarten, WSteinmetzer, T Development of substrate analogue inhibitors for the human airway trypsin-like protease HAT. Bioorg Med Chem Lett21:4860-4 (2011) 
 
Coagulation factor X
Name:Coagulation factor X
Type:Enzyme
Mol. Mass.:54726.60
Organism:Homo sapiens (Human)
Description:n/a
Residue:488
BDBM50349350
NameBDBM50349350
Synonyms:CHEMBL1809256
TypeSmall organic molecule
Emp. Form.C23H33N7O4S
Mol. Mass.503.618
SMILES[#7]\[#6](-[#7])=[#7]\[#6]-[#6]-[#6]-[#6@@H](-[#7]S(=O)(=O)[#6]-c1ccccc1)-[#6](=O)-[#6@H](-[#6]-[#8])-[#7]-[#6]-c1ccc(cc1)-[#6](-[#7])=[#7]