Reaction Details
TargetTransmembrane protease serine 11D
LigandBDBM50349361
Substrate/Competitorn/a
Meas. Tech.ChEMBL_760105 (CHEMBL1810428)
Ki 38±n/a nM
Citation Sielaff, FBöttcher-Friebertshäuser, EMeyer, DSaupe, SMVolk, IMGarten, WSteinmetzer, T Development of substrate analogue inhibitors for the human airway trypsin-like protease HAT. Bioorg Med Chem Lett21:4860-4 (2011) 
 
Transmembrane protease serine 11D
Name:Transmembrane protease serine 11D
Type:PROTEIN
Mol. Mass.:46272.53
Organism:Homo sapiens (Human)
Description:ChEMBL_840134
Residue:418
BDBM50349361
NameBDBM50349361
Synonyms:CHEMBL1809215
TypeSmall organic molecule
Emp. Form.C28H37N5O6S
Mol. Mass.571.688
SMILESCC(C)(C)OC(=O)C[C@@H](NS(=O)(=O)Cc1ccccc1)C(=O)N1CCC[C@H]1C(=O)NCc1ccc(cc1)C(N)=N