Reaction Details
TargetTransmembrane protease serine 11D
LigandBDBM50349362
Substrate/Competitorn/a
Meas. Tech.ChEMBL_760105 (CHEMBL1810428)
Ki 53±n/a nM
Citation Sielaff, FBöttcher-Friebertshäuser, EMeyer, DSaupe, SMVolk, IMGarten, WSteinmetzer, T Development of substrate analogue inhibitors for the human airway trypsin-like protease HAT. Bioorg Med Chem Lett21:4860-4 (2011) 
 
Transmembrane protease serine 11D
Name:Transmembrane protease serine 11D
Type:PROTEIN
Mol. Mass.:46272.53
Organism:Homo sapiens (Human)
Description:ChEMBL_840134
Residue:418
BDBM50349362
NameBDBM50349362
Synonyms:CHEMBL1809217
TypeSmall organic molecule
Emp. Form.C34H42N6O6S
Mol. Mass.662.799
SMILESNC(=N)c1ccc(CNC(=O)[C@@H]2CCCN2C(=O)[C@@H](CCCCNC(=O)OCc2ccccc2)NS(=O)(=O)Cc2ccccc2)cc1