Reaction Details
TargetTransmembrane protease serine 11D
LigandBDBM50324477
Substrate/Competitorn/a
Meas. Tech.ChEMBL_760105 (CHEMBL1810428)
Ki 108±n/a nM
Citation Sielaff, FBöttcher-Friebertshäuser, EMeyer, DSaupe, SMVolk, IMGarten, WSteinmetzer, T Development of substrate analogue inhibitors for the human airway trypsin-like protease HAT. Bioorg Med Chem Lett21:4860-4 (2011) 
 
Transmembrane protease serine 11D
Name:Transmembrane protease serine 11D
Type:PROTEIN
Mol. Mass.:46272.53
Organism:Homo sapiens (Human)
Description:ChEMBL_840134
Residue:418
BDBM50324477
NameBDBM50324477
Synonyms:Benzylsulfonyl-D-cyclohexylalanyl-proline-(4-amidinobenzyl)-amide Trifluoroacetate CHEMBL1229261
TypeSmall organic molecule
Emp. Form.C29H39N5O4S
Mol. Mass.553.716
SMILESNC(=N)c1ccc(CNC(=O)[C@@H]2CCCN2C(=O)[C@@H](CC2CCCCC2)NS(=O)(=O)Cc2ccccc2)cc1