Reaction Details
TargetPeroxisome proliferator-activated receptor alpha
LigandBDBM50349807
Substrate/Competitorn/a
Meas. Tech.ChEMBL_760320 (CHEMBL1815135)
EC50 0.026±n/a nM
Citation Raval, PJain, MGoswami, ABasu, SGite, AGodha, APingali, HRaval, SGiri, SSuthar, DShah, MPatel, P Revisiting glitazars: thiophene substituted oxazole containinga-ethoxy phenylpropanoic acid derivatives as highly potent PPARa/¿ dual agonists devoid of adverse effects in rodents. Bioorg Med Chem Lett21:3103-9 (2011) 
 
Peroxisome proliferator-activated receptor alpha
Name:Peroxisome proliferator-activated receptor alpha
Type:Enzyme
Mol. Mass.:52222.08
Organism:Homo sapiens (Human)
Description:Q07869
Residue:468
BDBM50349807
NameBDBM50349807
Synonyms:CHEMBL1813003
TypeSmall organic molecule
Emp. Form.C20H21NO5S
Mol. Mass.387.449
SMILESCCO[C@@H](Cc1ccc(OCc2nc(oc2C)-c2cccs2)cc1)C(O)=O