Reaction Details
TargetProprotein convertase subtilisin/kexin type 7
LigandBDBM50343352
Substrate/Competitorn/a
Meas. Tech.ChEMBL_760496 (CHEMBL1815481)
IC50 24590±n/a nM
Citation de Oliveira, CMSilva, GHRegasini, LOFlausino, OLópez, SNAbissi, BMBerlinck, RGSette, LDBonugli-Santos, RCRodrigues, ABolzani, Vda SAraujo, AR Xylarenones C-E from an endophytic fungus isolated from Alibertia macrophylla. J Nat Prod74:1353-7 (2011) 
 
Proprotein convertase subtilisin/kexin type 7
Name:Proprotein convertase subtilisin/kexin type 7
Type:PROTEIN
Mol. Mass.:86233.43
Organism:Homo sapiens (Human)
Description:ChEMBL_1290739
Residue:785
BDBM50343352
NameBDBM50343352
Synonyms:2-hydroxy-3-(3-oxo-1-phenylbutyl)-4H-chromen-4-one 4-Hydroxy-3-(3-oxo-1-phenyl-butyl)-chromen-2-one CHEMBL1464 Jantoven wafarin warfarine
TypeSmall organic molecule
Emp. Form.C19H16O4
Mol. Mass.308.3279
SMILESCC(=O)CC(c1ccccc1)c1c(O)c2ccccc2oc1=O