Reaction Details
TargetCarbonic anhydrase 5A, mitochondrial
LigandBDBM50167327
Substrate/Competitorn/a
Meas. Tech.ChEMBL_760552 (CHEMBL1815537)
Ki 48±n/a nM
Citation Carta, FGaraj, VMaresca, AWagner, JAvvaru, BSRobbins, AHScozzafava, AMcKenna, RSupuran, CT Sulfonamides incorporating 1,3,5-triazine moieties selectively and potently inhibit carbonic anhydrase transmembrane isoforms IX, XII and XIV over cytosolic isoforms I and II: Solution and X-ray crystallographic studies. Bioorg Med Chem19:3105-19 (2011) 
 
Carbonic anhydrase 5A, mitochondrial
Name:Carbonic anhydrase 5A, mitochondrial
Type:Enzyme
Mol. Mass.:34755.54
Organism:Homo sapiens (Human)
Description:Human (cloned) isozyme
Residue:305
BDBM50167327
NameBDBM50167327
Synonyms:CHEMBL191045 | [4-Chloro-6-(4-sulfamoyl-benzylamino)-[1,3,5]triazin-2-ylamino]-acetic acid
TypeSmall organic molecule
Emp. Form.C12H13ClN6O4S
Mol. Mass.372.787
SMILESNS(=O)(=O)c1ccc(CNc2nc(Cl)nc(NCC(O)=O)n2)cc1