Reaction Details
TargetCarbonic anhydrase 2
LigandBDBM50349847
Substrate/Competitorn/a
Meas. Tech.ChEMBL_760547 (CHEMBL1815532)
Ki 368±n/a nM
Citation Carta, FGaraj, VMaresca, AWagner, JAvvaru, BSRobbins, AHScozzafava, AMcKenna, RSupuran, CT Sulfonamides incorporating 1,3,5-triazine moieties selectively and potently inhibit carbonic anhydrase transmembrane isoforms IX, XII and XIV over cytosolic isoforms I and II: Solution and X-ray crystallographic studies. Bioorg Med Chem19:3105-19 (2011) 
 
Carbonic anhydrase 2
Name:Carbonic anhydrase 2
Type:Enzyme
Mol. Mass.:29250.71
Organism:Homo sapiens (Human)
Description:P00918
Residue:260
BDBM50349847
NameBDBM50349847
Synonyms:CHEMBL1813208
TypeSmall organic molecule
Emp. Form.C15H19N7O6S
Mol. Mass.425.42
SMILESNS(=O)(=O)c1ccc(Nc2nc(NCCC(O)=O)nc(NCCC(O)=O)n2)cc1