Reaction Details
TargetCarbonic anhydrase 2
LigandBDBM50167330
Substrate/Competitorn/a
Meas. Tech.ChEMBL_760547 (CHEMBL1815532)
Ki 33±n/a nM
Citation Carta, FGaraj, VMaresca, AWagner, JAvvaru, BSRobbins, AHScozzafava, AMcKenna, RSupuran, CT Sulfonamides incorporating 1,3,5-triazine moieties selectively and potently inhibit carbonic anhydrase transmembrane isoforms IX, XII and XIV over cytosolic isoforms I and II: Solution and X-ray crystallographic studies. Bioorg Med Chem19:3105-19 (2011) 
 
Carbonic anhydrase 2
Name:Carbonic anhydrase 2
Type:Enzyme
Mol. Mass.:29250.71
Organism:Homo sapiens (Human)
Description:P00918
Residue:260
BDBM50167330
NameBDBM50167330
Synonyms:CHEMBL190733 | {4-Chloro-6-[2-(4-sulfamoyl-phenyl)-ethylamino]-[1,3,5]triazin-2-ylamino}-acetic acid methyl ester
TypeSmall organic molecule
Emp. Form.C14H17ClN6O4S
Mol. Mass.400.841
SMILESCOC(=O)CNc1nc(Cl)nc(NCCc2ccc(cc2)S(N)(=O)=O)n1