Reaction Details
TargetCarbonic anhydrase 9
LigandBDBM50349846
Substrate/Competitorn/a
Meas. Tech.ChEMBL_760548 (CHEMBL1815533)
Ki 8.2±n/a nM
Citation Carta, FGaraj, VMaresca, AWagner, JAvvaru, BSRobbins, AHScozzafava, AMcKenna, RSupuran, CT Sulfonamides incorporating 1,3,5-triazine moieties selectively and potently inhibit carbonic anhydrase transmembrane isoforms IX, XII and XIV over cytosolic isoforms I and II: Solution and X-ray crystallographic studies. Bioorg Med Chem19:3105-19 (2011) 
 
Carbonic anhydrase 9
Name:Carbonic anhydrase 9
Type:Enzyme
Mol. Mass.:49669.03
Organism:Homo sapiens (Human)
Description:Catalytic domain of human cloned isozyme was used in the assay
Residue:459
BDBM50349846
NameBDBM50349846
Synonyms:CHEMBL1738792
TypeSmall organic molecule
Emp. Form.C12H13ClN6O4S
Mol. Mass.372.787
SMILESCOC(=O)CNc1nc(Cl)nc(Nc2ccc(cc2)S(N)(=O)=O)n1