Reaction Details
TargetCarbonic anhydrase 9
LigandBDBM50349849
Substrate/Competitorn/a
Meas. Tech.ChEMBL_760548 (CHEMBL1815533)
Ki 8.9±n/a nM
Citation Carta, FGaraj, VMaresca, AWagner, JAvvaru, BSRobbins, AHScozzafava, AMcKenna, RSupuran, CT Sulfonamides incorporating 1,3,5-triazine moieties selectively and potently inhibit carbonic anhydrase transmembrane isoforms IX, XII and XIV over cytosolic isoforms I and II: Solution and X-ray crystallographic studies. Bioorg Med Chem19:3105-19 (2011) 
 
Carbonic anhydrase 9
Name:Carbonic anhydrase 9
Type:Enzyme
Mol. Mass.:49669.03
Organism:Homo sapiens (Human)
Description:Catalytic domain of human cloned isozyme was used in the assay
Residue:459
BDBM50349849
NameBDBM50349849
Synonyms:CHEMBL1813210
TypeSmall organic molecule
Emp. Form.C12H13ClN6O5S
Mol. Mass.388.787
SMILESNS(=O)(=O)c1ccc(Nc2nc(Cl)nc(NC(CO)C(O)=O)n2)cc1