Reaction Details
TargetCarbonic anhydrase 9
LigandBDBM50349853
Substrate/Competitorn/a
Meas. Tech.ChEMBL_760548 (CHEMBL1815533)
Ki 34.1±n/a nM
Citation Carta, FGaraj, VMaresca, AWagner, JAvvaru, BSRobbins, AHScozzafava, AMcKenna, RSupuran, CT Sulfonamides incorporating 1,3,5-triazine moieties selectively and potently inhibit carbonic anhydrase transmembrane isoforms IX, XII and XIV over cytosolic isoforms I and II: Solution and X-ray crystallographic studies. Bioorg Med Chem19:3105-19 (2011) 
 
Carbonic anhydrase 9
Name:Carbonic anhydrase 9
Type:Enzyme
Mol. Mass.:49669.03
Organism:Homo sapiens (Human)
Description:Catalytic domain of human cloned isozyme was used in the assay
Residue:459
BDBM50349853
NameBDBM50349853
Synonyms:CHEMBL1813215
TypeSmall organic molecule
Emp. Form.C13H15ClN6O4S
Mol. Mass.386.814
SMILESNS(=O)(=O)c1ccc(CNc2nc(Cl)nc(NCCC(O)=O)n2)cc1