Reaction Details
TargetCarbonic anhydrase 9
LigandBDBM50349857
Substrate/Competitorn/a
Meas. Tech.ChEMBL_760548 (CHEMBL1815533)
Ki 9±n/a nM
Citation Carta, FGaraj, VMaresca, AWagner, JAvvaru, BSRobbins, AHScozzafava, AMcKenna, RSupuran, CT Sulfonamides incorporating 1,3,5-triazine moieties selectively and potently inhibit carbonic anhydrase transmembrane isoforms IX, XII and XIV over cytosolic isoforms I and II: Solution and X-ray crystallographic studies. Bioorg Med Chem19:3105-19 (2011) 
 
Carbonic anhydrase 9
Name:Carbonic anhydrase 9
Type:Enzyme
Mol. Mass.:49669.03
Organism:Homo sapiens (Human)
Description:Catalytic domain of human cloned isozyme was used in the assay
Residue:459
BDBM50349857
NameBDBM50349857
Synonyms:CHEMBL1813219
TypeSmall organic molecule
Emp. Form.C17H23N7O8S
Mol. Mass.485.472
SMILESNS(=O)(=O)c1ccc(CCNc2nc(NC(CO)C(O)=O)nc(NC(CO)C(O)=O)n2)cc1