Reaction Details
TargetCarbonic anhydrase 9
LigandBDBM50349858
Substrate/Competitorn/a
Meas. Tech.ChEMBL_760548 (CHEMBL1815533)
Ki 1.3±n/a nM
Citation Carta, FGaraj, VMaresca, AWagner, JAvvaru, BSRobbins, AHScozzafava, AMcKenna, RSupuran, CT Sulfonamides incorporating 1,3,5-triazine moieties selectively and potently inhibit carbonic anhydrase transmembrane isoforms IX, XII and XIV over cytosolic isoforms I and II: Solution and X-ray crystallographic studies. Bioorg Med Chem19:3105-19 (2011) 
 
Carbonic anhydrase 9
Name:Carbonic anhydrase 9
Type:Enzyme
Mol. Mass.:49669.03
Organism:Homo sapiens (Human)
Description:Catalytic domain of human cloned isozyme was used in the assay
Residue:459
BDBM50349858
NameBDBM50349858
Synonyms:CHEMBL78755
TypeSmall organic molecule
Emp. Form.C14H15N3O5S2
Mol. Mass.369.416
SMILESCc1ccc(cc1)S(=O)(=O)NC(=O)Nc1ccc(cc1)S(N)(=O)=O