Reaction Details
TargetCarbonic anhydrase 12
LigandBDBM50153974
Substrate/Competitorn/a
Meas. Tech.ChEMBL_760549 (CHEMBL1815534)
Ki 56.2±n/a nM
Citation Carta, FGaraj, VMaresca, AWagner, JAvvaru, BSRobbins, AHScozzafava, AMcKenna, RSupuran, CT Sulfonamides incorporating 1,3,5-triazine moieties selectively and potently inhibit carbonic anhydrase transmembrane isoforms IX, XII and XIV over cytosolic isoforms I and II: Solution and X-ray crystallographic studies. Bioorg Med Chem19:3105-19 (2011) 
 
Carbonic anhydrase 12
Name:Carbonic anhydrase 12
Type:Enzyme
Mol. Mass.:39456.00
Organism:Homo sapiens (Human)
Description:Catalytic domain of human cloned isozyme was used in the assay
Residue:354
BDBM50153974
NameBDBM50153974
Synonyms:4-[(4,6-Dichloro-[1,3,5]triazin-2-ylamino)-methyl]-benzenesulfonamide | CHEMBL187901
TypeSmall organic molecule
Emp. Form.C10H9Cl2N5O2S
Mol. Mass.334.182
SMILESNS(=O)(=O)c1ccc(CNc2nc(Cl)nc(Cl)n2)cc1