Reaction Details
TargetCarbonic anhydrase 12
LigandBDBM50167330
Substrate/Competitorn/a
Meas. Tech.ChEMBL_760549 (CHEMBL1815534)
Ki 2.9±n/a nM
Citation Carta, FGaraj, VMaresca, AWagner, JAvvaru, BSRobbins, AHScozzafava, AMcKenna, RSupuran, CT Sulfonamides incorporating 1,3,5-triazine moieties selectively and potently inhibit carbonic anhydrase transmembrane isoforms IX, XII and XIV over cytosolic isoforms I and II: Solution and X-ray crystallographic studies. Bioorg Med Chem19:3105-19 (2011) 
 
Carbonic anhydrase 12
Name:Carbonic anhydrase 12
Type:Enzyme
Mol. Mass.:39456.00
Organism:Homo sapiens (Human)
Description:Catalytic domain of human cloned isozyme was used in the assay
Residue:354
BDBM50167330
NameBDBM50167330
Synonyms:CHEMBL190733 | {4-Chloro-6-[2-(4-sulfamoyl-phenyl)-ethylamino]-[1,3,5]triazin-2-ylamino}-acetic acid methyl ester
TypeSmall organic molecule
Emp. Form.C14H17ClN6O4S
Mol. Mass.400.841
SMILESCOC(=O)CNc1nc(Cl)nc(NCCc2ccc(cc2)S(N)(=O)=O)n1