Reaction Details
TargetKappa-type opioid receptor
LigandBDBM50349894
Substrate/Competitorn/a
Meas. Tech.ChEMBL_762062 (CHEMBL1816054)
Ki>40000±n/a nM
Citation Kim, JHDeschamps, JRRothman, RBDersch, CMFolk, JECheng, KJacobson, AERice, KC Probes for narcotic receptor mediated phenomena. Part 42: synthesis and in vitro pharmacological characterization of the N-methyl and N-phenethyl analogues of the racemic ortho-c and para-c oxide-bridged phenylmorphans. Bioorg Med Chem19:3434-43 (2011) 
 
Kappa-type opioid receptor
Name:Kappa-type opioid receptor
Type:G Protein-Coupled Receptor (GPCR)
Mol. Mass.:42648.76
Organism:Homo sapiens (Human)
Description:P41145
Residue:380
BDBM50349894
NameBDBM50349894
Synonyms:CHEMBL1814702
TypeSmall organic molecule
Emp. Form.C15H19NO2
Mol. Mass.245.3169
SMILESCN1C[C@H]2Oc3c(cccc3O)[C@@]22CCC[C@@H]1C2