Reaction Details
TargetTyrosine-protein phosphatase non-receptor type 1
LigandBDBM50213251
Substrate/Competitorn/a
Meas. Tech.ChEMBL_762179 (CHEMBL1816250)
IC50 29200±n/a nM
Citation Nguyen, PHDao, TTKim, JPhong, do TNdinteh, DTMbafor, JTOh, WK New 5-deoxyflavonoids and their inhibitory effects on protein tyrosine phosphatase 1B (PTP1B) activity. Bioorg Med Chem19:3378-83 (2011) 
 
Tyrosine-protein phosphatase non-receptor type 1
Name:Tyrosine-protein phosphatase non-receptor type 1
Type:Protein phosphatase
Mol. Mass.:49963.76
Organism:Homo sapiens (Human)
Description:Human recombinant GST-fusion PTP1B (1-435).
Residue:435
BDBM50213251
NameBDBM50213251
Synonyms:(rac)-7-hydroxy-2-(4-hydroxy-3-(3-methylbut-2-enyl)phenyl)chroman-4-one 7-hydroxy-2-[4-hydroxy-3-(3-methylbut-2-enyl)phenyl]chroman-4-one CHEMBL389924
TypeSmall organic molecule
Emp. Form.C20H20O4
Mol. Mass.324.3704
SMILES[#6]\[#6](-[#6])=[#6]\[#6]-c1cc(ccc1-[#8])-[#6]-1-[#6]-[#6](=O)-c2ccc(-[#8])cc2-[#8]-1