Reaction Details
TargetTyrosine-protein phosphatase non-receptor type 1
LigandBDBM50349929
Substrate/Competitorn/a
Meas. Tech.ChEMBL_762179 (CHEMBL1816250)
IC50 98100±n/a nM
Citation Nguyen, PHDao, TTKim, JPhong, do TNdinteh, DTMbafor, JTOh, WK New 5-deoxyflavonoids and their inhibitory effects on protein tyrosine phosphatase 1B (PTP1B) activity. Bioorg Med Chem19:3378-83 (2011) 
 
Tyrosine-protein phosphatase non-receptor type 1
Name:Tyrosine-protein phosphatase non-receptor type 1
Type:Protein phosphatase
Mol. Mass.:49963.76
Organism:Homo sapiens (Human)
Description:Human recombinant GST-fusion PTP1B (1-435).
Residue:435
BDBM50349929
NameBDBM50349929
Synonyms:CHEMBL1811969
TypeSmall organic molecule
Emp. Form.C16H14O5
Mol. Mass.286.2794
SMILESCOc1cc(ccc1O)[C@@H]1CC(=O)c2ccc(O)cc2O1