Reaction Details
TargetSodium channel protein type 9 subunit alpha
LigandBDBM50350000
Substrate/Competitorn/a
Meas. Tech.ChEMBL_762090 (CHEMBL1816129)
IC50>10000±n/a nM
Citation Bregman, HBerry, LBuchanan, JLChen, ADu, BFeric, EHierl, MHuang, LImmke, DJanosky, BJohnson, DLi, XLigutti, JLiu, DMalmberg, AMatson, DMcDermott, JMiu, PNguyen, HNPatel, VFWaldon, DWilenkin, BZheng, XMZou, AMcDonough, SIDiMauro, EF Identification of a potent, state-dependent inhibitor of Nav1.7 with oral efficacy in the formalin model of persistent pain. J Med Chem54:4427-45 (2011) 
 
Sodium channel protein type 9 subunit alpha
Name:Sodium channel protein type 9 subunit alpha
Type:Protein
Mol. Mass.:226375.97
Organism:Homo sapiens (Human)
Description:Q15858
Residue:1988
BDBM50350000
NameBDBM50350000
Synonyms:CHEMBL1813036
TypeSmall organic molecule
Emp. Form.C25H30N6O2
Mol. Mass.446.5447
SMILESCC(OC1CCN(CC1)c1ncnc(Nc2cccc(NC(C)=O)c2C)n1)c1ccccc1