Reaction Details
TargetSodium channel protein type 10 subunit alpha
LigandBDBM50349984
Substrate/Competitorn/a
Meas. Tech.ChEMBL_762195 (CHEMBL1816266)
IC50 2200±n/a nM
Citation Bregman, HBerry, LBuchanan, JLChen, ADu, BFeric, EHierl, MHuang, LImmke, DJanosky, BJohnson, DLi, XLigutti, JLiu, DMalmberg, AMatson, DMcDermott, JMiu, PNguyen, HNPatel, VFWaldon, DWilenkin, BZheng, XMZou, AMcDonough, SIDiMauro, EF Identification of a potent, state-dependent inhibitor of Nav1.7 with oral efficacy in the formalin model of persistent pain. J Med Chem54:4427-45 (2011) 
 
Sodium channel protein type 10 subunit alpha
Name:Sodium channel protein type 10 subunit alpha
Type:Enzyme
Mol. Mass.:219724.17
Organism:Rattus norvegicus (Rat)
Description:Q62968
Residue:1956
BDBM50349984
NameBDBM50349984
Synonyms:CHEMBL1813048
TypeSmall organic molecule
Emp. Form.C25H27F3N6O3
Mol. Mass.516.5155
SMILESCC(=O)Nc1cccc(Nc2ncnc(n2)N2CCC(CC2)OCc2ccc(OC(F)(F)F)cc2)c1C