Reaction Details
TargetPotassium voltage-gated channel subfamily H member 2
LigandBDBM50349987
Substrate/Competitorn/a
Meas. Tech.ChEMBL_762093 (CHEMBL1816132)
IC50>10000±n/a nM
Citation Bregman, HBerry, LBuchanan, JLChen, ADu, BFeric, EHierl, MHuang, LImmke, DJanosky, BJohnson, DLi, XLigutti, JLiu, DMalmberg, AMatson, DMcDermott, JMiu, PNguyen, HNPatel, VFWaldon, DWilenkin, BZheng, XMZou, AMcDonough, SIDiMauro, EF Identification of a potent, state-dependent inhibitor of Nav1.7 with oral efficacy in the formalin model of persistent pain. J Med Chem54:4427-45 (2011) 
 
Potassium voltage-gated channel subfamily H member 2
Name:Potassium voltage-gated channel subfamily H member 2
Type:Multi-pass membrane protein
Mol. Mass.:126672.65
Organism:Homo sapiens (Human)
Description:Q12809
Residue:1159
BDBM50349987
NameBDBM50349987
Synonyms:CHEMBL1813042
TypeSmall organic molecule
Emp. Form.C25H27F3N6O2
Mol. Mass.500.5161
SMILESCC(=O)Nc1cccc(Nc2ncnc(n2)N2CCC(CC2)OCc2ccc(cc2)C(F)(F)F)c1C