Reaction Details
TargetPoly(ADP-ribose) glycohydrolase
LigandBDBM50350095
Substrate/Competitorn/a
Meas. Tech.ChEMBL_760969 (CHEMBL1814966)
IC50 12000±n/a nM
Citation Steffen, JDCoyle, DLDamodaran, KBeroza, PJacobson, MK Discovery and structure-activity relationships of modified salicylanilides as cell permeable inhibitors of poly(ADP-ribose) glycohydrolase (PARG). J Med Chem54:5403-13 (2011) 
 
Poly(ADP-ribose) glycohydrolase
Name:Poly(ADP-ribose) glycohydrolase
Type:Protein
Mol. Mass.:111107.13
Organism:Homo sapiens (Human)
Description:Q86W56
Residue:976
BDBM50350095
NameBDBM50350095
Synonyms:CHEMBL1813881
TypeSmall organic molecule
Emp. Form.C23H14Cl3NO3
Mol. Mass.458.721
SMILESOc1c(Cl)cc(Cl)cc1C(=O)Nc1ccc(Oc2ccc3ccccc3c2)c(Cl)c1