Reaction Details
TargetPolyunsaturated fatty acid lipoxygenase ALOX12
LigandBDBM50350394
Substrate/Competitorn/a
Meas. Tech.ChEMBL_761393 (CHEMBL1817023)
IC50 1000±n/a nM
Citation Kenyon, VRai, GJadhav, ASchultz, LArmstrong, MJameson, JBPerry, SJoshi, NBougie, JMLeister, WTaylor-Fishwick, DANadler, JLHolinstat, MSimeonov, AMaloney, DJHolman, TR Discovery of potent and selective inhibitors of human platelet-type 12- lipoxygenase. J Med Chem54:5485-97 (2011) 
 
Polyunsaturated fatty acid lipoxygenase ALOX12
Name:Polyunsaturated fatty acid lipoxygenase ALOX12
Type:Protein
Mol. Mass.:75689.18
Organism:Homo sapiens (Human)
Description:P18054
Residue:663
BDBM50350394
NameBDBM50350394
Synonyms:CHEMBL528045
TypeSmall organic molecule
Emp. Form.C16H13ClN2O2S
Mol. Mass.332.805
SMILESCC(=O)NC(c1cccs1)c1cc(Cl)c2cccnc2c1O