Reaction Details
TargetFatty-acid amide hydrolase 1
LigandBDBM26736
Substrate/Competitorn/a
Meas. Tech.ChEMBL_762794 (CHEMBL1816096)
IC50 12±n/a nM
Citation Otrubova, KEzzili, CBoger, DL The discovery and development of inhibitors of fatty acid amide hydrolase (FAAH). Bioorg Med Chem Lett21:4674-85 (2011) 
 
Fatty-acid amide hydrolase 1
Name:Fatty-acid amide hydrolase 1
Type:Protein
Mol. Mass.:63071.19
Organism:Homo sapiens (Human)
Description:O00519
Residue:579
BDBM26736
NameBDBM26736
Synonyms:CHEMBL509860 N,N-dimethyl-5-[(4-phenylphenyl)methyl]-1H-1,2,3,4-tetrazole-1-carboxamide
TypeSmall organic molecule
Emp. Form.C17H17N5O
Mol. Mass.307.3498
SMILESCN(C)C(=O)n1nnnc1Cc1ccc(cc1)-c1ccccc1