Reaction Details
TargetFatty-acid amide hydrolase 1
LigandBDBM50350538
Substrate/Competitorn/a
Meas. Tech.ChEMBL_762794 (CHEMBL1816096)
IC50 25±n/a nM
Citation Otrubova, KEzzili, CBoger, DL The discovery and development of inhibitors of fatty acid amide hydrolase (FAAH). Bioorg Med Chem Lett21:4674-85 (2011) 
 
Fatty-acid amide hydrolase 1
Name:Fatty-acid amide hydrolase 1
Type:Protein
Mol. Mass.:63071.19
Organism:Homo sapiens (Human)
Description:O00519
Residue:579
BDBM50350538
NameBDBM50350538
Synonyms:CHEMBL1812717
TypeSmall organic molecule
Emp. Form.C22H17ClFN3O2S
Mol. Mass.441.906
SMILESCC(C)(O)c1ccc(cn1)-c1nc(oc1Sc1ccc(Cl)cn1)-c1ccc(F)cc1