Reaction Details
TargetFatty-acid amide hydrolase 1
LigandBDBM50161525
Substrate/Competitorn/a
Meas. Tech.ChEMBL_762794 (CHEMBL1816096)
Ki 0.520±n/a nM
Citation Otrubova, KEzzili, CBoger, DL The discovery and development of inhibitors of fatty acid amide hydrolase (FAAH). Bioorg Med Chem Lett21:4674-85 (2011) 
 
Fatty-acid amide hydrolase 1
Name:Fatty-acid amide hydrolase 1
Type:Protein
Mol. Mass.:63071.19
Organism:Homo sapiens (Human)
Description:O00519
Residue:579
BDBM50161525
NameBDBM50161525
Synonyms:1-(oxazolo[4,5-b]pyridin-2-yl)-9-phenylnonan-1-one CHEMBL182199
TypeSmall organic molecule
Emp. Form.C21H24N2O2
Mol. Mass.336.4275
SMILESO=C(CCCCCCCCc1ccccc1)c1nc2ncccc2o1