Reaction Details
TargetFatty-acid amide hydrolase 1
LigandBDBM50350547
Substrate/Competitorn/a
Meas. Tech.ChEMBL_762794 (CHEMBL1816096)
Ki 0.57±n/a nM
Citation Otrubova, KEzzili, CBoger, DL The discovery and development of inhibitors of fatty acid amide hydrolase (FAAH). Bioorg Med Chem Lett21:4674-85 (2011) 
 
Fatty-acid amide hydrolase 1
Name:Fatty-acid amide hydrolase 1
Type:Protein
Mol. Mass.:63071.19
Organism:Homo sapiens (Human)
Description:O00519
Residue:579
BDBM50350547
NameBDBM50350547
Synonyms:CHEMBL257307
TypeSmall organic molecule
Emp. Form.C18H26N2O2
Mol. Mass.302.4112
SMILESCCCCCCCCCCCC(=O)c1nc2ncccc2o1