Reaction Details
TargetFatty-acid amide hydrolase 1
LigandBDBM50350559
Substrate/Competitorn/a
Meas. Tech.ChEMBL_762790 (CHEMBL1816092)
IC50 12±n/a nM
Citation Otrubova, KEzzili, CBoger, DL The discovery and development of inhibitors of fatty acid amide hydrolase (FAAH). Bioorg Med Chem Lett21:4674-85 (2011) 
 
Fatty-acid amide hydrolase 1
Name:Fatty-acid amide hydrolase 1
Type:Hydrolase; single-pass membrane protein; homodimer
Mol. Mass.:63227.28
Organism:Mus musculus (mouse)
Description:Mouse brain membranes were used in the assay.
Residue:579
BDBM50350559
NameBDBM50350559
Synonyms:CHEMBL1812718
TypeSmall organic molecule
Emp. Form.C25H24N2O5
Mol. Mass.432.4685
SMILES[O-][N+](=O)c1ccc(OC(=O)N2CCC(Cc3cccc(Oc4ccccc4)c3)CC2)cc1