Reaction Details
TargetFatty-acid amide hydrolase 1
LigandBDBM50339888
Substrate/Competitorn/a
Meas. Tech.ChEMBL_762791 (CHEMBL1816093)
IC50 10±n/a nM
Citation Otrubova, KEzzili, CBoger, DL The discovery and development of inhibitors of fatty acid amide hydrolase (FAAH). Bioorg Med Chem Lett21:4674-85 (2011) 
 
Fatty-acid amide hydrolase 1
Name:Fatty-acid amide hydrolase 1
Type:Protein
Mol. Mass.:63071.19
Organism:Homo sapiens (Human)
Description:O00519
Residue:579
BDBM50339888
NameBDBM50339888
Synonyms:1-(1-(4-(benzofuran-2-yl)pyrimidin-2-yl)piperidin-3-yl)-3-ethyl-1H-benzo[d]imidazol-2(3H)-one | CHEMBL1761282
TypeSmall organic molecule
Emp. Form.C26H25N5O2
Mol. Mass.439.509
SMILESCCn1c2ccccc2n(C2CCCN(C2)c2nccc(n2)-c2cc3ccccc3o2)c1=O