Reaction Details
TargetPotassium voltage-gated channel subfamily H member 2
LigandBDBM50350791
Substrate/Competitorn/a
Meas. Tech.ChEMBL_763235 (CHEMBL1820248)
IC50 13000±n/a nM
Citation Sintra Grilo, LCarrupt, PAAbriel, HDaina, A Block of the hERG channel by bupivacaine: Electrophysiological and modeling insights towards stereochemical optimization. Eur J Med Chem46:3486-98 (2011) 
 
Potassium voltage-gated channel subfamily H member 2
Name:Potassium voltage-gated channel subfamily H member 2
Type:Multi-pass membrane protein
Mol. Mass.:126672.65
Organism:Homo sapiens (Human)
Description:Q12809
Residue:1159
BDBM50350791
NameBDBM50350791
Synonyms:LEVOBUPIVACAINE HYDROCHLORIDE
TypeSmall organic molecule
Emp. Form.C18H28N2O
Mol. Mass.288.4277
SMILESCCCCN1CCCC[C@H]1C(=O)Nc1c(C)cccc1C