Reaction Details
TargetVasopressin V1b receptor
LigandBDBM50350853
Substrate/Competitorn/a
Meas. Tech.ChEMBL_763491 (CHEMBL1819840)
EC50 32±n/a nM
Citation Wisniewski, KGalyean, RTariga, HAlagarsamy, SCroston, GHeitzmann, JKohan, AWisniewska, HLaporte, RRivière, PJSchteingart, CD New, potent, selective, and short-acting peptidic V1a receptor agonists. J Med Chem54:4388-98 (2011) 
 
Vasopressin V1b receptor
Name:Vasopressin V1b receptor
Type:Enzyme
Mol. Mass.:46985.01
Organism:Homo sapiens (Human)
Description:P47901
Residue:424
BDBM50350853
NameBDBM50350853
Synonyms:CHEMBL1817707
TypeSmall organic molecule
Emp. Form.C44H69N13O11S2
Mol. Mass.1020.229
SMILESCCNCCC[C@H](NC(=O)[C@@H]1CCCN1C(=O)[C@@H]1CSSC[C@H](N)C(=O)N[C@@H](Cc2ccccc2)C(=O)N[C@@H]([C@@H](C)CC)C(=O)N[C@@H](CCC(N)=O)C(=O)N[C@@H](CC(N)=O)C(=O)N1)C(=O)NCC(N)=O