Reaction Details
TargetVasopressin V1b receptor
LigandBDBM50350885
Substrate/Competitorn/a
Meas. Tech.ChEMBL_763491 (CHEMBL1819840)
EC50 44±n/a nM
Citation Wisniewski, KGalyean, RTariga, HAlagarsamy, SCroston, GHeitzmann, JKohan, AWisniewska, HLaporte, RRivière, PJSchteingart, CD New, potent, selective, and short-acting peptidic V1a receptor agonists. J Med Chem54:4388-98 (2011) 
 
Vasopressin V1b receptor
Name:Vasopressin V1b receptor
Type:Enzyme
Mol. Mass.:46985.01
Organism:Homo sapiens (Human)
Description:P47901
Residue:424
BDBM50350885
NameBDBM50350885
Synonyms:CHEMBL1819552
TypeSmall organic molecule
Emp. Form.C39H67N13O11S2
Mol. Mass.958.16
SMILESCC[C@H](C)[C@@H]1NC(=O)[C@H](CC(C)(C)C)NC(=O)[C@@H](N)CSSC[C@H](NC(=O)[C@H](CC(N)=O)NC(=O)[C@H](CCC(N)=O)NC1=O)C(=O)N1CCC[C@H]1C(=O)N[C@@H](CCN)C(=O)NCC(N)=O