Reaction Details
TargetInhibitor of nuclear factor kappa-B kinase subunit beta
LigandBDBM50138400
Substrate/Competitorn/a
Meas. Tech.ChEMBL_763187 (CHEMBL1820098)
IC50 44±n/a nM
Citation Bamborough, PBrown, MJChristopher, JAChung, CWMellor, GW Selectivity of kinase inhibitor fragments. J Med Chem54:5131-43 (2011) 
 
Inhibitor of nuclear factor kappa-B kinase subunit beta
Name:Inhibitor of nuclear factor kappa-B kinase subunit beta
Type:Serine/threonine-protein kinase
Mol. Mass.:86554.39
Organism:Homo sapiens (Human)
Description:GST-tagged IKK-2 was expressed in High Five cells and purified.
Residue:756
BDBM50138400
NameBDBM50138400
Synonyms:4-{4-[4-(Piperazine-1-sulfonyl)-phenyl]-pyrimidin-2-ylamino}-benzonitrile | CHEMBL132416
TypeSmall organic molecule
Emp. Form.C21H20N6O2S
Mol. Mass.420.487
SMILESO=S(=O)(N1CCNCC1)c1ccc(cc1)-c1ccnc(Nc2ccc(cc2)C#N)n1