Reaction Details
TargetMitogen-activated protein kinase 14
LigandBDBM50350909
Substrate/Competitorn/a
Meas. Tech.ChEMBL_763188 (CHEMBL1820099)
IC50>630957±n/a nM
Citation Bamborough, PBrown, MJChristopher, JAChung, CWMellor, GW Selectivity of kinase inhibitor fragments. J Med Chem54:5131-43 (2011) 
 
Mitogen-activated protein kinase 14
Name:Mitogen-activated protein kinase 14
Type:Serine/threonine-protein kinase
Mol. Mass.:41286.76
Organism:Homo sapiens (Human)
Description:Q16539
Residue:360
BDBM50350909
NameBDBM50350909
Synonyms:CHEMBL1650061
TypeSmall organic molecule
Emp. Form.C10H9N3
Mol. Mass.171.1986
SMILESN(c1ccccc1)c1ncccn1