Reaction Details
TargetMitogen-activated protein kinase 8
LigandBDBM16223
Substrate/Competitorn/a
Meas. Tech.ChEMBL_763186 (CHEMBL1820097)
IC50>630957±n/a nM
Citation Bamborough, PBrown, MJChristopher, JAChung, CWMellor, GW Selectivity of kinase inhibitor fragments. J Med Chem54:5131-43 (2011) 
 
Mitogen-activated protein kinase 8
Name:Mitogen-activated protein kinase 8
Type:Enzyme
Mol. Mass.:48297.57
Organism:Homo sapiens (Human)
Description:JNK-1 was purchased from Upstate Cell Signaling Solutions (formerly Upstate Biotechnology).
Residue:427
BDBM16223
NameBDBM16223
Synonyms:1H-pyrrolo[2,3-b]pyridine compound 2
TypeSmall organic molecule
Emp. Form.C7H6N2
Mol. Mass.118.1359
SMILESc1cc2cccnc2[nH]1