Reaction Details
TargetRAC-alpha serine/threonine-protein kinase
LigandBDBM24627
Substrate/Competitorn/a
Meas. Tech.ChEMBL_763185 (CHEMBL1820096)
IC50>400000±n/a nM
Citation Bamborough, PBrown, MJChristopher, JAChung, CWMellor, GW Selectivity of kinase inhibitor fragments. J Med Chem54:5131-43 (2011) 
 
RAC-alpha serine/threonine-protein kinase
Name:RAC-alpha serine/threonine-protein kinase
Type:Enzyme
Mol. Mass.:55681.25
Organism:Homo sapiens (Human)
Description:P31749
Residue:480
BDBM24627
NameBDBM24627
Synonyms:1H-indazole Indazole, 6
TypeSmall organic molecule
Emp. Form.C7H6N2
Mol. Mass.118.1359
SMILESc1n[nH]c2ccccc12