Reaction Details
TargetMu-type opioid receptor
LigandBDBM50350975
Substrate/Competitorn/a
Meas. Tech.ChEMBL_763653 (CHEMBL1820179)
Ki 1260±n/a nM
Citation Verhoest, PRBasak, ASParikh, VHayward, MKauffman, GWParadis, VMcHardy, SFMcLean, SGrimwood, SSchmidt, AWVanase-Frawley, MFreeman, JVan Deusen, JCox, LWong, DLiras, S Design and discovery of a selective small molecule¿ opioid antagonist (2-methyl-N-((2'-(pyrrolidin-1-ylsulfonyl)biphenyl-4-yl)methyl)propan-1-amine, PF-4455242). J Med Chem54:5868-77 (2011) 
 
Mu-type opioid receptor
Name:Mu-type opioid receptor
Type:G Protein-Coupled Receptor (GPCR)
Mol. Mass.:44789.51
Organism:Homo sapiens (Human)
Description:P35372
Residue:400
BDBM50350975
NameBDBM50350975
Synonyms:CHEMBL1818340
TypeSmall organic molecule
Emp. Form.C22H30N2O2S
Mol. Mass.386.551
SMILESCC(C)N(C)S(=O)(=O)c1ccccc1-c1ccc(CN2CCCCC2)cc1