Reaction Details
TargetMu-type opioid receptor
LigandBDBM50350957
Substrate/Competitorn/a
Meas. Tech.ChEMBL_763653 (CHEMBL1820179)
Ki 207±n/a nM
Citation Verhoest, PRBasak, ASParikh, VHayward, MKauffman, GWParadis, VMcHardy, SFMcLean, SGrimwood, SSchmidt, AWVanase-Frawley, MFreeman, JVan Deusen, JCox, LWong, DLiras, S Design and discovery of a selective small molecule¿ opioid antagonist (2-methyl-N-((2'-(pyrrolidin-1-ylsulfonyl)biphenyl-4-yl)methyl)propan-1-amine, PF-4455242). J Med Chem54:5868-77 (2011) 
 
Mu-type opioid receptor
Name:Mu-type opioid receptor
Type:G Protein-Coupled Receptor (GPCR)
Mol. Mass.:44789.51
Organism:Homo sapiens (Human)
Description:P35372
Residue:400
BDBM50350957
NameBDBM50350957
Synonyms:CHEMBL1818235
TypeSmall organic molecule
Emp. Form.C26H34N2O3S
Mol. Mass.454.625
SMILESCOC[C@@H]1CCCN1S(=O)(=O)c1ccccc1-c1ccc(CN2C[C@H]3C[C@@H]2CCC3)cc1