Reaction Details
TargetKappa-type opioid receptor
LigandBDBM50350984
Substrate/Competitorn/a
Meas. Tech.ChEMBL_763652 (CHEMBL1820178)
Ki 5.8±n/a nM
Citation Verhoest, PRBasak, ASParikh, VHayward, MKauffman, GWParadis, VMcHardy, SFMcLean, SGrimwood, SSchmidt, AWVanase-Frawley, MFreeman, JVan Deusen, JCox, LWong, DLiras, S Design and discovery of a selective small molecule¿ opioid antagonist (2-methyl-N-((2'-(pyrrolidin-1-ylsulfonyl)biphenyl-4-yl)methyl)propan-1-amine, PF-4455242). J Med Chem54:5868-77 (2011) 
 
Kappa-type opioid receptor
Name:Kappa-type opioid receptor
Type:G Protein-Coupled Receptor (GPCR)
Mol. Mass.:42648.76
Organism:Homo sapiens (Human)
Description:P41145
Residue:380
BDBM50350984
NameBDBM50350984
Synonyms:CHEMBL1818331
TypeSmall organic molecule
Emp. Form.C21H29N3O2S
Mol. Mass.387.539
SMILESCN(C)CCNCc1ccc(cc1)-c1ccccc1S(=O)(=O)N1CCCC1